{"text_format":"1","workbook":"xlsx","n_sheets":8,"sheets":["Presentación","Huella Minima","Huella Completa","Resultados","Datos_presupuesto","Calculos 1","Calculos 2","Factores de emision"],"not_rendered":{"charts":2,"images":41,"macros":1,"external_links":0,"defined_names":39,"comments":0,"pivot_tables":0},"unopened":[],"bounds":{"document_bytes":16777216,"sheet_cells":100000,"rows_first":2000,"rows_last":500,"rows_between":2000,"halvings":0,"cell_chars":16384,"cell_head_chars":4096},"cells_cut":0,"cells_raw":0,"read":"whole","date_system":"1900"}

{"sheet":"Presentación","index":0,"n_rows":0,"n_cols":0,"rows_kept":0,"cut":false,"hidden":false,"merged":[]}

{"sheet":"Huella Minima","index":1,"n_rows":15,"n_cols":3,"rows_kept":15,"cut":false,"hidden":false,"merged":[]}
[]
[]
[]
[]
[]
[]
[]
["Huella Mínima",{"$f":"'Calculos 1'!C251","v":0},"kg CO2"]
[]
[]
["Para compensar el impacto de huella mínima la producción en emisiones de gases de efecto invernadero:"]
[]
[{"$f":"CONCATENATE(\"Habria que plantar \",compensacion_hm,\" árboles y mantenerlos durante 30 años.\")","v":"Habria que plantar 0 árboles y mantenerlos durante 30 años."}]
[]
["Este resultado no es el impacto al completo tán solo una aproximación."]

{"sheet":"Huella Completa","index":2,"n_rows":210,"n_cols":5,"rows_kept":210,"cut":false,"hidden":false,"merged":[[6,2,6,3],[5,2,5,3]]}
[]
[]
[]
[]
[]
["0.1","Título de la producción:"]
["0.2","Presupuesto total en €: "]
[]
[null,null,"Nº de días de trabajo","Nº de personas ","Presupuesto en €"]
["0.3","Preproducción"]
["0.4","Producción"]
["0.5","Postproducción"]
[]
[]
[]
[]
[]
[]
[]
[]
{"$rows_left_out":191}
{"sheet":"Resultados","index":3,"n_rows":109,"n_cols":12,"rows_kept":109,"cut":false,"hidden":false,"merged":[[34,6,34,8],[95,2,95,14]]}
[]
[]
[]
[]
[]
[]
[]
[]
[]
[]
[]
[null,{"$f":"CONCATENATE(\"La huella de carbono de: \",Titulo,\" es de \",'Calculos 2'!N2,\" Toneladas de CO2 equivalentes (tonCO2eq)\",\n\"\",)","v":"La huella de carbono de:  es de 0 Toneladas de CO2 equivalentes (tonCO2eq)"}]
[]
[]
[null,"Emisiones por tipo de actividad",null,null,null,null,null,null,null,"Emisiones por fase de la producción."]
[]
[null,null,null,"tonCO2eq",null,null,null,null,null,null,null,"tonCO2eq"]
[null,null,"Transporte",{"$f":"'Calculos 2'!G2","v":0},null,null,null,null,null,null,"Preproducción",{"$f":"'Calculos 2'!K2","v":0}]
[null,null,"Hospedaje",{"$f":"'Calculos 2'!G3","v":0},null,null,null,null,null,null,"Producción",{"$f":"'Calculos 2'!K3","v":0}]
[null,null,"Electricidad generada y consumida",{"$f":"'Calculos 2'!G4","v":0},null,null,null,null,null,null,"Postproducción",{"$f":"'Calculos 2'!K4","v":0}]
{"$rows_left_out":90}
{"sheet":"Datos_presupuesto","index":4,"n_rows":0,"n_cols":0,"rows_kept":0,"cut":false,"hidden":false,"merged":[]}

{"sheet":"Calculos 1","index":5,"n_rows":251,"n_cols":10,"rows_kept":251,"cut":false,"hidden":false,"merged":[[0,7,2,7]]}
["Códigos","Formula",null,null,null,null,null,"Escenografía","emi_04.01","Decorados y escenarios"]
["04.01.01",{"$f":"VLOOKUP(A2,Datos_presupuesto!A1:H252,5,FALSE)+VLOOKUP(A2,Datos_presupuesto!A1:H252,6,FALSE)+VLOOKUP(A2,Datos_presupuesto!A1:H252,7,FALSE)+VLOOKUP(A2,Datos_presupuesto!A1:H252,8,FALSE)","v":{"$error":"#N/A"}},null,null,null,null,null,null,"emi_04.02","Ambientación"]
["04.01.02",{"$f":"VLOOKUP(A3,Datos_presupuesto!A2:H253,5,FALSE)+VLOOKUP(A3,Datos_presupuesto!A2:H253,6,FALSE)+VLOOKUP(A3,Datos_presupuesto!A2:H253,7,FALSE)+VLOOKUP(A3,Datos_presupuesto!A2:H253,8,FALSE)","v":{"$error":"#N/A"}},null,null,null,null,null,null,"emi_04.03","Vestuario"]
["04.01.03",{"$f":"VLOOKUP(A4,Datos_presupuesto!A3:H254,5,FALSE)+VLOOKUP(A4,Datos_presupuesto!A3:H254,6,FALSE)+VLOOKUP(A4,Datos_presupuesto!A3:H254,7,FALSE)+VLOOKUP(A4,Datos_presupuesto!A3:H254,8,FALSE)","v":{"$error":"#N/A"}}]
["04.01.04",{"$f":"VLOOKUP(A5,Datos_presupuesto!A4:H255,5,FALSE)+VLOOKUP(A5,Datos_presupuesto!A4:H255,6,FALSE)+VLOOKUP(A5,Datos_presupuesto!A4:H255,7,FALSE)+VLOOKUP(A5,Datos_presupuesto!A4:H255,8,FALSE)","v":{"$error":"#N/A"}},null,null,null,null,null,null,"emi_05.03","Varios producción"]
["04.01.05",{"$f":"VLOOKUP(A6,Datos_presupuesto!A5:H256,5,FALSE)+VLOOKUP(A6,Datos_presupuesto!A5:H256,6,FALSE)+VLOOKUP(A6,Datos_presupuesto!A5:H256,7,FALSE)+VLOOKUP(A6,Datos_presupuesto!A5:H256,8,FALSE)","v":{"$error":"#N/A"}},null,null,null,null,null,null,"emi_06.01","Adquisición de alquiler de maquinaria y elementos de rodaje"]
["04.01.06",{"$f":"VLOOKUP(A7,Datos_presupuesto!A6:H257,5,FALSE)+VLOOKUP(A7,Datos_presupuesto!A6:H257,6,FALSE)+VLOOKUP(A7,Datos_presupuesto!A6:H257,7,FALSE)+VLOOKUP(A7,Datos_presupuesto!A6:H257,8,FALSE)","v":{"$error":"#N/A"}},{"$f":"SUM(B2:B7)*'Factores de emision'!D28","v":{"$error":"#N/A"}}]
[]
["04.01.07",{"$f":"VLOOKUP(A9,Datos_presupuesto!A8:H259,5,FALSE)+VLOOKUP(A9,Datos_presupuesto!A8:H259,6,FALSE)+VLOOKUP(A9,Datos_presupuesto!A8:H259,7,FALSE)+VLOOKUP(A9,Datos_presupuesto!A8:H259,8,FALSE)","v":{"$error":"#N/A"}}]
["04.01.08",{"$f":"VLOOKUP(A10,Datos_presupuesto!A9:H260,5,FALSE)+VLOOKUP(A10,Datos_presupuesto!A9:H260,6,FALSE)+VLOOKUP(A10,Datos_presupuesto!A9:H260,7,FALSE)+VLOOKUP(A10,Datos_presupuesto!A9:H260,8,FALSE)","v":{"$error":"#N/A"}},{"$f":"B9+B10*'Factores de emision'!D28/10","v":{"$error":"#N/A"}},null,"emi_04.01",{"$f":"C7+C10","v":{"$error":"#N/A"}}]
[]
["04.02.01",{"$f":"VLOOKUP(A12,Datos_presupuesto!A11:H262,5,FALSE)+VLOOKUP(A12,Datos_presupuesto!A11:H262,6,FALSE)+VLOOKUP(A12,Datos_presupuesto!A11:H262,7,FALSE)+VLOOKUP(A12,Datos_presupuesto!A11:H262,8,FALSE)","v":{"$error":"#N/A"}}]
["04.02.02",{"$f":"VLOOKUP(A13,Datos_presupuesto!A12:H263,5,FALSE)+VLOOKUP(A13,Datos_presupuesto!A12:H263,6,FALSE)+VLOOKUP(A13,Datos_presupuesto!A12:H263,7,FALSE)+VLOOKUP(A13,Datos_presupuesto!A12:H263,8,FALSE)","v":{"$error":"#N/A"}},{"$f":"B12+B13*'Factores de emision'!D28/10","v":{"$error":"#N/A"}}]
[]
["04.02.03",{"$f":"VLOOKUP(A15,Datos_presupuesto!A14:H265,5,FALSE)+VLOOKUP(A15,Datos_presupuesto!A14:H265,6,FALSE)+VLOOKUP(A15,Datos_presupuesto!A14:H265,7,FALSE)+VLOOKUP(A15,Datos_presupuesto!A14:H265,8,FALSE)","v":{"$error":"#N/A"}}]
["02.08.06",{"$f":"VLOOKUP(A16,Datos_presupuesto!A15:H266,5,FALSE)+VLOOKUP(A16,Datos_presupuesto!A15:H266,6,FALSE)+VLOOKUP(A16,Datos_presupuesto!A15:H266,7,FALSE)+VLOOKUP(A16,Datos_presupuesto!A15:H266,8,FALSE)","v":{"$error":"#N/A"}}]
["04.02.05",{"$f":"VLOOKUP(A17,Datos_presupuesto!A16:H267,5,FALSE)+VLOOKUP(A17,Datos_presupuesto!A16:H267,6,FALSE)+VLOOKUP(A17,Datos_presupuesto!A16:H267,7,FALSE)+VLOOKUP(A17,Datos_presupuesto!A16:H267,8,FALSE)","v":{"$error":"#N/A"}}]
["04.02.06",{"$f":"VLOOKUP(A18,Datos_presupuesto!A17:H268,5,FALSE)+VLOOKUP(A18,Datos_presupuesto!A17:H268,6,FALSE)+VLOOKUP(A18,Datos_presupuesto!A17:H268,7,FALSE)+VLOOKUP(A18,Datos_presupuesto!A17:H268,8,FALSE)","v":{"$error":"#N/A"}},{"$f":"SUM(B15:B18)*'Factores de emision'!D28","v":{"$error":"#N/A"}},null,"emi_04.02",{"$f":"C18","v":{"$error":"#N/A"}}]
[]
["04.03.01",{"$f":"VLOOKUP(A20,Datos_presupuesto!A19:H270,5,FALSE)+VLOOKUP(A20,Datos_presupuesto!A19:H270,6,FALSE)+VLOOKUP(A20,Datos_presupuesto!A19:H270,7,FALSE)+VLOOKUP(A20,Datos_presupuesto!A19:H270,8,FALSE)","v":{"$error":"#N/A"}}]
{"$rows_left_out":232}
{"sheet":"Calculos 2","index":6,"n_rows":1020,"n_cols":22,"rows_kept":1020,"cut":false,"hidden":false,"merged":[]}
["Calculos","kgCO2",null,null,null,"kgCO2","tonCO2eq",null,null,"kgCO2","tonCO2eq",null,"kgCO2","TonCO2","€ Presupuesto","personas/dia de trabajo","kg CO2 personas día de trabajo",null,null,"Compensación ","Huella Mínma","Compensación Huella Mínma"]
["1.1",{"$f":"VLOOKUP('Calculos 2'!A2,'Huella Completa'!A16:G702,3,FALSE)*(IF(VLOOKUP('Calculos 2'!A2,'Huella Completa'!A16:G702,4,FALSE)=\"Gasolina\",Gasolina,IF(VLOOKUP('Calculos 2'!A2,'Huella Completa'!A16:G702,4,FALSE)=\"Diesel\",Diesel,IF(VLOOKUP('Calculos 2'!A2,'Huella Completa'!A16:G702,4,FALSE)=\"GLP\",GLP,0))))","v":0},null,null,"Transporte",{"$f":"VLOOKUP(\"1.0\",A:C,3,FALSE)+VLOOKUP(\"2.0\",A:C,3,FALSE)+VLOOKUP(\"4.0\",A:C,3,FALSE)+VLOOKUP(\"5.0\",A:C,3,FALSE)","v":0},{"$f":"F2/1000","v":0},null,"Preproducción",{"$f":"VLOOKUP(\"1.0\",A:C,3,FALSE)+VLOOKUP(\"2.0\",A:C,3,FALSE)+VLOOKUP(\"3.0\",A:C,3,FALSE)+_xlfn.AGGREGATE(9,6,emi_04.01,emi_04.02,emi_04.03)","v":0},{"$f":"J2/1000","v":0},"TOTAL ",{"$f":"'Huella Minima'!$B$8+'Calculos 2'!B1020","v":0},{"$f":"M2/1000","v":0},{"$f":"M2/presupuesto","v":{"$error":"#DIV/0!"}},{"$f":"P9","v":0},{"$f":"M2/P2","v":{"$error":"#DIV/0!"}},null,null,{"$f":"ROUNDUP((N2/0.3*1.4),0)","v":0},{"$f":"'Calculos 1'!C251","v":0},{"$f":"ROUNDUP((U2/1000/0.3*1.4),0)","v":0}]
["1.2",{"$f":"VLOOKUP('Calculos 2'!A3,'Huella Completa'!A17:G703,3,FALSE)*(IF(VLOOKUP('Calculos 2'!A3,'Huella Completa'!A17:G703,4,FALSE)=\"Gasolina\",Gasolina,IF(VLOOKUP('Calculos 2'!A3,'Huella Completa'!A17:G703,4,FALSE)=\"Diesel\",Diesel,IF(VLOOKUP('Calculos 2'!A3,'Huella Completa'!A17:G703,4,FALSE)=\"GLP\",GLP,0))))","v":0},null,null,"Hospedaje",{"$f":"VLOOKUP(\"3.0\",A:C,3,FALSE)+VLOOKUP(\"6.0\",A:C,3,FALSE)","v":0},{"$f":"F3/1000","v":0},null,"Producción",{"$f":"VLOOKUP(\"4.0\",A:C,3,FALSE)+VLOOKUP(\"5.0\",A:C,3,FALSE)+VLOOKUP(\"6.0\",A:C,3,FALSE)+VLOOKUP(\"7.0\",A:C,3,FALSE)+VLOOKUP(\"8.0\",A:C,3,FALSE)+VLOOKUP(\"9.0\",A:C,3,FALSE)+_xlfn.AGGREGATE(9,6,emi_06.01,emi_05.03)+VLOOKUP(\"13.0\",A:C,3,FALSE)","v":0},{"$f":"J3/1000","v":0}]
["1.3",{"$f":"VLOOKUP('Calculos 2'!A4,'Huella Completa'!A18:G704,3,FALSE)*(IF(VLOOKUP('Calculos 2'!A4,'Huella Completa'!A18:G704,4,FALSE)=\"Gasolina\",Gasolina,IF(VLOOKUP('Calculos 2'!A4,'Huella Completa'!A18:G704,4,FALSE)=\"Diesel\",Diesel,IF(VLOOKUP('Calculos 2'!A4,'Huella Completa'!A18:G704,4,FALSE)=\"GLP\",GLP,0))))","v":0},null,null,"Electricidad generada y consumida",{"$f":"VLOOKUP(\"8.0\",A:C,3,FALSE)+VLOOKUP(\"9.0\",A:C,3,FALSE)","v":0},0,null,"Postproducción",{"$f":"VLOOKUP(\"14.0\",A:C,3,FALSE)","v":0},0]
["1.4",{"$f":"VLOOKUP('Calculos 2'!A5,'Huella Completa'!A19:G705,3,FALSE)*(IF(VLOOKUP('Calculos 2'!A5,'Huella Completa'!A19:G705,4,FALSE)=\"Gasolina\",Gasolina,IF(VLOOKUP('Calculos 2'!A5,'Huella Completa'!A19:G705,4,FALSE)=\"Diesel\",Diesel,IF(VLOOKUP('Calculos 2'!A5,'Huella Completa'!A19:G705,4,FALSE)=\"GLP\",GLP,0))))","v":0},null,null,"Catering ",{"$f":"VLOOKUP(\"7.0\",A:C,3,FALSE)","v":0},0,null,null,null,null,null,null,null,{"$f":"'Huella Completa'!C9","v":"Nº de días de trabajo"},{"$f":"'Huella Completa'!D9","v":"Nº de personas "},{"$f":"'Huella Completa'!E9","v":"Presupuesto en €"}]
["1.5",{"$f":"VLOOKUP('Calculos 2'!A6,'Huella Completa'!A20:G706,3,FALSE)*(IF(VLOOKUP('Calculos 2'!A6,'Huella Completa'!A20:G706,4,FALSE)=\"Gasolina\",Gasolina,IF(VLOOKUP('Calculos 2'!A6,'Huella Completa'!A20:G706,4,FALSE)=\"Diesel\",Diesel,IF(VLOOKUP('Calculos 2'!A6,'Huella Completa'!A20:G706,4,FALSE)=\"GLP\",GLP,0))))","v":0},null,null,"Escenografía",{"$f":"_xlfn.AGGREGATE(9,6,emi_04.01,emi_04.02,emi_04.03)","v":0},0,null,null,null,null,null,null,{"$f":"'Huella Completa'!B10","v":"Preproducción"},{"$f":"'Huella Completa'!C10","v":0},{"$f":"'Huella Completa'!D10","v":0},{"$f":"'Huella Completa'!E10","v":0},{"$f":"O6*P6","v":0},{"$f":"$Q$2*R6","v":{"$error":"#DIV/0!"}},{"$f":"$O$2*Q6","v":{"$error":"#DIV/0!"}}]
["1.6",{"$f":"VLOOKUP('Calculos 2'!A7,'Huella Completa'!A21:G707,3,FALSE)*(IF(VLOOKUP('Calculos 2'!A7,'Huella Completa'!A21:G707,4,FALSE)=\"Gasolina\",Gasolina,IF(VLOOKUP('Calculos 2'!A7,'Huella Completa'!A21:G707,4,FALSE)=\"Diesel\",Diesel,IF(VLOOKUP('Calculos 2'!A7,'Huella Completa'!A21:G707,4,FALSE)=\"GLP\",GLP,0))))","v":0},null,null,"Adquisición y alquiler de maquinaría y elementos para el rodaje",{"$f":"_xlfn.AGGREGATE(9,6,emi_06.01,emi_05.03)","v":0},0,null,null,null,null,null,null,{"$f":"'Huella Completa'!B11","v":"Producción"},{"$f":"'Huella Completa'!C11","v":0},{"$f":"'Huella Completa'!D11","v":0},{"$f":"'Huella Completa'!E11","v":0},{"$f":"O7*P7","v":0},{"$f":"$Q$2*R7","v":{"$error":"#DIV/0!"}},{"$f":"$O$2*Q7","v":{"$error":"#DIV/0!"}}]
["1.7",{"$f":"VLOOKUP('Calculos 2'!A8,'Huella Completa'!A23:G708,3,FALSE)*(IF(VLOOKUP('Calculos 2'!A8,'Huella Completa'!A23:G708,4,FALSE)=\"Gasolina\",Gasolina,IF(VLOOKUP('Calculos 2'!A8,'Huella Completa'!A23:G708,4,FALSE)=\"Diesel\",Diesel,IF(VLOOKUP('Calculos 2'!A8,'Huella Completa'!A23:G708,4,FALSE)=\"GLP\",GLP,0))))","v":0},null,null,null,null,null,null,null,null,null,null,null,{"$f":"'Huella Completa'!B12","v":"Postproducción"},{"$f":"'Huella Completa'!C12","v":0},{"$f":"'Huella Completa'!D12","v":0},{"$f":"'Huella Completa'!E12","v":0},0,{"$error":"#DIV/0!"},{"$error":"#DIV/0!"}]
["1.8",{"$f":"VLOOKUP('Calculos 2'!A9,'Huella Completa'!A24:G709,3,FALSE)*(IF(VLOOKUP('Calculos 2'!A9,'Huella Completa'!A24:G709,4,FALSE)=\"Gasolina\",Gasolina,IF(VLOOKUP('Calculos 2'!A9,'Huella Completa'!A24:G709,4,FALSE)=\"Diesel\",Diesel,IF(VLOOKUP('Calculos 2'!A9,'Huella Completa'!A24:G709,4,FALSE)=\"GLP\",GLP,0))))","v":0},null,null,null,null,null,null,"emi_04.01","Decorados y escenarios",null,null,null,null,null,{"$f":"O6*P6+O7*P7+O8*P8","v":0},null,"TOTAL",{"$f":"SUM(S6:S8)","v":{"$error":"#DIV/0!"}},{"$f":"SUM(T6:T8)","v":{"$error":"#DIV/0!"}}]
["1.9",{"$f":"VLOOKUP('Calculos 2'!A10,'Huella Completa'!A25:G710,3,FALSE)*(IF(VLOOKUP('Calculos 2'!A10,'Huella Completa'!A25:G710,4,FALSE)=\"Gasolina\",Gasolina,IF(VLOOKUP('Calculos 2'!A10,'Huella Completa'!A25:G710,4,FALSE)=\"Diesel\",Diesel,IF(VLOOKUP('Calculos 2'!A10,'Huella Completa'!A25:G710,4,FALSE)=\"GLP\",GLP,0))))","v":0},null,null,null,null,null,null,"emi_04.02","Ambientación"]
["1.10",{"$f":"VLOOKUP('Calculos 2'!A11,'Huella Completa'!A26:G711,3,FALSE)*(IF(VLOOKUP('Calculos 2'!A11,'Huella Completa'!A26:G711,4,FALSE)=\"Gasolina\",Gasolina,IF(VLOOKUP('Calculos 2'!A11,'Huella Completa'!A26:G711,4,FALSE)=\"Diesel\",Diesel,IF(VLOOKUP('Calculos 2'!A11,'Huella Completa'!A26:G711,4,FALSE)=\"GLP\",GLP,0))))","v":0},null,null,null,null,null,null,"emi_04.03","Vestuario"]
["1.11",{"$f":"VLOOKUP('Calculos 2'!A12,'Huella Completa'!A34:G712,3,FALSE)*(IF(VLOOKUP('Calculos 2'!A12,'Huella Completa'!A34:G712,4,FALSE)=\"Gasolina\",Gasolina,IF(VLOOKUP('Calculos 2'!A12,'Huella Completa'!A34:G712,4,FALSE)=\"Diesel\",Diesel,IF(VLOOKUP('Calculos 2'!A12,'Huella Completa'!A34:G712,4,FALSE)=\"GLP\",GLP,0))))","v":{"$error":"#N/A"}},null,null,null,null,null,null,"emi_05.03","Varios producción"]
["1.12",{"$f":"VLOOKUP('Calculos 2'!A13,'Huella Completa'!A35:G713,3,FALSE)*(IF(VLOOKUP('Calculos 2'!A13,'Huella Completa'!A35:G713,4,FALSE)=\"Gasolina\",Gasolina,IF(VLOOKUP('Calculos 2'!A13,'Huella Completa'!A35:G713,4,FALSE)=\"Diesel\",Diesel,IF(VLOOKUP('Calculos 2'!A13,'Huella Completa'!A35:G713,4,FALSE)=\"GLP\",GLP,0))))","v":{"$error":"#N/A"}},null,null,null,null,null,null,"emi_06.01","Adquisición de alquiler de maquinaria y elementos de rodaje"]
["1.13",{"$f":"VLOOKUP('Calculos 2'!A14,'Huella Completa'!A36:G714,3,FALSE)*(IF(VLOOKUP('Calculos 2'!A14,'Huella Completa'!A36:G714,4,FALSE)=\"Gasolina\",Gasolina,IF(VLOOKUP('Calculos 2'!A14,'Huella Completa'!A36:G714,4,FALSE)=\"Diesel\",Diesel,IF(VLOOKUP('Calculos 2'!A14,'Huella Completa'!A36:G714,4,FALSE)=\"GLP\",GLP,0))))","v":{"$error":"#N/A"}}]
["1.14",{"$f":"VLOOKUP('Calculos 2'!A15,'Huella Completa'!A37:G715,3,FALSE)*(IF(VLOOKUP('Calculos 2'!A15,'Huella Completa'!A37:G715,4,FALSE)=\"Gasolina\",Gasolina,IF(VLOOKUP('Calculos 2'!A15,'Huella Completa'!A37:G715,4,FALSE)=\"Diesel\",Diesel,IF(VLOOKUP('Calculos 2'!A15,'Huella Completa'!A37:G715,4,FALSE)=\"GLP\",GLP,0))))","v":{"$error":"#N/A"}},null,null,"RECOMENDACIONES"]
["1.15",{"$f":"VLOOKUP('Calculos 2'!A16,'Huella Completa'!A38:G716,3,FALSE)*(IF(VLOOKUP('Calculos 2'!A16,'Huella Completa'!A38:G716,4,FALSE)=\"Gasolina\",Gasolina,IF(VLOOKUP('Calculos 2'!A16,'Huella Completa'!A38:G716,4,FALSE)=\"Diesel\",Diesel,IF(VLOOKUP('Calculos 2'!A16,'Huella Completa'!A38:G716,4,FALSE)=\"GLP\",GLP,0))))","v":{"$error":"#N/A"}},null,null,"Preproducción"]
["1.16",{"$f":"VLOOKUP('Calculos 2'!A17,'Huella Completa'!A39:G717,3,FALSE)*(IF(VLOOKUP('Calculos 2'!A17,'Huella Completa'!A39:G717,4,FALSE)=\"Gasolina\",Gasolina,IF(VLOOKUP('Calculos 2'!A17,'Huella Completa'!A39:G717,4,FALSE)=\"Diesel\",Diesel,IF(VLOOKUP('Calculos 2'!A17,'Huella Completa'!A39:G717,4,FALSE)=\"GLP\",GLP,0))))","v":{"$error":"#N/A"}},null,null,{"$f":"IF(pre_vehiculo=\"siempre\",\"¡Genial! Has usado vehículo eléctrico o híbrido  para el transporte en la fase de preproducción.\",IF(pre_vehiculo=\"normalmente\",\"¡Muy bien! has intentado usar el vehículo eléctrico o híbrido siempre que has podido en la preproducción sigue así.\",IF(pre_vehiculo=\"a veces\",\"Un primer paso siempre es importante. Sigue intentando usar el vehículo eléctrico o híbrido en tus viajes.\",IF(pre_vehiculo=\"nunca\",\"Plantéate usar el vehículo eléctrico o híbrido en tus viajes de la preproducción. Con esta decisión puedes bajar significativamente la huella de carbono.\",\" \"))))","v":" "}]
["1.17",{"$f":"VLOOKUP('Calculos 2'!A18,'Huella Completa'!A40:G718,3,FALSE)*(IF(VLOOKUP('Calculos 2'!A18,'Huella Completa'!A40:G718,4,FALSE)=\"Gasolina\",Gasolina,IF(VLOOKUP('Calculos 2'!A18,'Huella Completa'!A40:G718,4,FALSE)=\"Diesel\",Diesel,IF(VLOOKUP('Calculos 2'!A18,'Huella Completa'!A40:G718,4,FALSE)=\"GLP\",GLP,0))))","v":{"$error":"#N/A"}},null,null,"¡Recuerda! para los transportes en bus, tren o avión el tren es el transporte con menor huella de carbono, selecciónalo siempre que sea posible."]
["1.18",{"$f":"VLOOKUP('Calculos 2'!A19,'Huella Completa'!A41:G719,3,FALSE)*(IF(VLOOKUP('Calculos 2'!A19,'Huella Completa'!A41:G719,4,FALSE)=\"Gasolina\",Gasolina,IF(VLOOKUP('Calculos 2'!A19,'Huella Completa'!A41:G719,4,FALSE)=\"Diesel\",Diesel,IF(VLOOKUP('Calculos 2'!A19,'Huella Completa'!A41:G719,4,FALSE)=\"GLP\",GLP,0))))","v":{"$error":"#N/A"}},null,null,{"$f":"IF(Elec_hotel1=\"siempre\",\"¡Genial! Has elegido contratar hoteles y hospedaje con certificado de sostenibilidad.\",IF(Elec_hotel1=\"normalmente\",\"¡Muy bien! has intentado contratar hoteles certificado de sostenibilidad.\",IF(Elec_hotel1=\"a veces\",\"Un primer paso siempre es importante. Sigue intentando contratar alojamientos con certificado de sostenibilidad para mejorar tu huella de carbono.\",IF(Elec_hotel1=\"nunca\",\"Plantéate contratar alojamientos con certificado de sostenibilidad. Con esta decisión puedes bajar significativamente la huella de carbono.\",\" \"))))","v":" "}]
["1.19",{"$f":"VLOOKUP('Calculos 2'!A20,'Huella Completa'!A42:G720,3,FALSE)*(IF(VLOOKUP('Calculos 2'!A20,'Huella Completa'!A42:G720,4,FALSE)=\"Gasolina\",Gasolina,IF(VLOOKUP('Calculos 2'!A20,'Huella Completa'!A42:G720,4,FALSE)=\"Diesel\",Diesel,IF(VLOOKUP('Calculos 2'!A20,'Huella Completa'!A42:G720,4,FALSE)=\"GLP\",GLP,0))))","v":{"$error":"#N/A"}},null,null,"Producción"]
{"$rows_left_out":1001}
{"sheet":"Factores de emision","index":7,"n_rows":117,"n_cols":14,"rows_kept":117,"cut":false,"hidden":false,"merged":[[48,10,53,10],[54,10,56,10],[57,10,64,10],[65,10,68,10],[57,1,64,1],[65,1,68,1],[46,1,46,2],[48,1,53,1],[54,1,56,1],[47,0,47,4],[26,0,46,0],[26,1,26,2],[27,1,27,2],[28,1,28,2],[29,1,29,2],[30,1,30,2],[31,1,31,2],[32,1,32,2],[33,1,33,2],[45,1,45,2],[40,1,40,2],[41,1,41,2],[42,1,42,2],[43,1,43,2],[44,1,44,2],[39,1,39,2],[11,1,11,2],[12,1,12,2],[13,1,17,1],[18,1,18,2],[34,1,34,2],[35,1,35,2],[36,1,36,2],[37,1,37,2],[38,1,38,2],[19,0,25,0],[19,1,19,2],[20,1,20,2],[21,1,21,2],[22,1,22,2],[23,1,23,2],[24,1,25,2],[5,0,18,0],[5,1,5,2],[6,1,7,1],[8,1,9,1],[10,1,10,2],[0,0,0,3],[2,0,3,0],[2,1,2,2],[3,1,3,2],[4,1,4,2],[92,10,97,10],[92,11,96,11],[98,10,104,10],[70,10,90,10],[69,0,69,4],[70,1,90,1],[92,1,97,1],[92,2,96,2],[98,1,104,1]]}
["FUENTE DE EMISIÓN"]
[null,null,null,"Valor (Uds.)"]
["Combustión fija","Gas natural",null,"0,253","kgCO2/kWh"]
[null,"Gasóleo C",null,2828,"kCO2/l"]
["Electricidad","Mix eléctrico español sin GdO, 2015",null,0.43,"kgCO2/kWh"]
["Transporte","Avión pasajeros",null,{"$f":"0.00027*1000","v":0.27},0.133595138]
[null,"Buques","Gasolina",2.2050000000000001,"kgCO2/l"]
[null,null,"Gasoil",2.508,"kgCO2/l"]
[null,"Aeronaves","Gasolina",69300,"kgCO2/TJ"]
[null,null,"Queroseno",71500,"kgCO2/TJ"]
[null,"Tren",null,"0,017","kgCO2/km.per"]
[null,"Autobús",null,"0,05517","kgCO2/km.per"]
[null,"Moto",null,"0,13","kgCO2/km.per"]
[null,"Coches según combustible","Diesel",2.508,"kgCO2/l"]
[null,null,"Gasolina",2.2050000000000001,"kgCO2/l"]
[null,null,"E10",2.0649999999999999,"kgCO2/l"]
[null,null,"GLP",1.671,"kgCO2/l"]
[null,null,"B30",1.831,"kgCO2/l"]
[null,"Coche genérico (Tr. interno)",null,1.669,"kgCO2/km"]
["Residuos","TIPO",null,"Transporte + Tratamiento"]
{"$rows_left_out":97}